Uploaded image for project: 'ONOS'
  1. ONOS
  2. ONOS-1716

Occasional test failures in AbstractAccumulatorTest

    XMLWordPrintable

    Details

    • Type: Bug
    • Status: Closed (View Workflow)
    • Priority: Minor
    • Resolution: Done
    • Affects Version/s: None
    • Fix Version/s: 1.4.0
    • Component/s: None
    • Labels:
      None
    • Environment:

      master

      Description

      Running org.onlab.util.AbstractAccumulatorTest
      Tests run: 7, Failures: 1, Errors: 0, Skipped: 1, Time elapsed: 0.532 sec <<< FAILURE! - in org.onlab.util.AbstractAccumulatorTest
      readyMaxTrigger(org.onlab.util.AbstractAccumulatorTest) Time elapsed: 0.017 sec <<< FAILURE!
      java.lang.AssertionError: should have fired
      at org.junit.Assert.fail(Assert.java:88)
      at org.junit.Assert.assertTrue(Assert.java:41)
      at org.junit.Assert.assertFalse(Assert.java:64)
      at org.onlab.util.AbstractAccumulatorTest.readyMaxTrigger(AbstractAccumulatorTest.java:130)

        Attachments

        No reviews matched the request. Check your Options in the drop-down menu of this sections header.

          Activity

            People

            • Assignee:
              aaron Aaron Kruglikov
              Reporter:
              bocon Brian O'Connor
            • Votes:
              0 Vote for this issue
              Watchers:
              1 Start watching this issue

              Dates

              • Created:
                Updated:
                Resolved: