Uploaded image for project: 'ONOS'
  1. ONOS
  2. ONOS-4539

for leaf type leafref, no error but build failed

    XMLWordPrintable

    Details

    • Type: Bug
    • Status: Closed (View Workflow)
    • Priority: Major
    • Resolution: Done
    • Affects Version/s: None
    • Fix Version/s: 1.6.0
    • Component/s: None
    • Environment:

      ONOS BUILD COMPILATION

    • Story Points:
      3

      Description

      yang snippet:

      leaf ten

      { type leafref; }

      log:
      1.6.0-SNAPSHOT
      [INFO] Scanning for projects...
      [INFO]
      [INFO] ------------------------------------------------------------------------
      [INFO] Building onlab-rest 1.6.0-SNAPSHOT
      [INFO] ------------------------------------------------------------------------
      [INFO]
      [INFO] — maven-clean-plugin:2.5:clean (default-clean) @ onlab-rest —
      [INFO]
      [INFO] — jacoco-maven-plugin:0.7.5.201505241946:prepare-agent (default-prepare-agent) @ onlab-rest —
      [INFO] argLine set to -javaagent:/root/.m2/repository/org/jacoco/org.jacoco.agent/0.7.5.201505241946/org.jacoco.agent-0.7.5.201505241946-runtime.jar=destfile=/home/root1/onos/utils/test/target/jacoco.exec -Duser.language=en -Duser.region=US
      [INFO]
      [INFO] — yangutils-maven-plugin:1.0.0-SNAPSHOT:yang2java (default) @ onlab-rest —
      [INFO] ------------------------------------------------------------------------
      [INFO] BUILD FAILURE
      [INFO] ------------------------------------------------------------------------
      [INFO] Total time: 2.651 s
      [INFO] Finished at: 2016-05-13T17:11:44+05:30
      [INFO] Final Memory: 18M/308M
      [INFO] ------------------------------------------------------------------------
      [ERROR] Failed to execute goal org.onosproject:yangutils-maven-plugin:1.0.0-SNAPSHOT:yang2java (default) on project onlab-rest: Execution default of goal org.onosproject:yangutils-maven-plugin:1.0.0-SNAPSHOT:yang2java failed. NullPointerException -> [Help 1]
      [ERROR]
      [ERROR] To see the full stack trace of the errors, re-run Maven with the -e switch.
      [ERROR] Re-run Maven using the -X switch to enable full debug logging.
      [ERROR]
      [ERROR] For more information about the errors and possible solutions, please read the following articles:
      [ERROR] [Help 1] http://cwiki.apache.org/confluence/display/MAVEN/PluginExecutionException

        Attachments

        No reviews matched the request. Check your Options in the drop-down menu of this sections header.

          Activity

            People

            • Assignee:
              janani Janani B
              Reporter:
              sathishmurugesan sathishkumar murugesan
            • Votes:
              0 Vote for this issue
              Watchers:
              2 Start watching this issue

              Dates

              • Created:
                Updated:
                Resolved: