Uploaded image for project: 'ONOS'
  1. ONOS
  2. ONOS-4548

Build failure occurring when building with dummy application.

    XMLWordPrintable

    Details

    • Type: Bug
    • Status: Closed (View Workflow)
    • Priority: Major
    • Resolution: Done
    • Affects Version/s: None
    • Fix Version/s: 1.6.0
    • Component/s: None
    • Labels:
      None
    • Story Points:
      7

      Description

      Pls check this issue and confirm,

      Defect : Build failure occurring when building with dummy application.

      Build is passing without test application.

      https://gerrit.onosproject.org/#/c/8979/11

      root1@root1-HP-EliteBook-840-G2:/opt/onos-master/onos/utils/test$ mvn clean install
      [INFO] Scanning for projects...
      [INFO]
      [INFO] ------------------------------------------------------------------------
      [INFO] Building onlab-rest 1.6.0-SNAPSHOT
      [INFO] ------------------------------------------------------------------------
      Downloading: http://repo.maven.apache.org/maven2/org/apache/maven/maven-compat/3.0-alpha-2/maven-compat-3.0-alpha-2.jar
      Downloading: http://repo.maven.apache.org/maven2/org/apache/maven/wagon/wagon-provider-api/1.0-beta-4/wagon-provider-api-1.0-beta-4.jar
      Downloaded: http://repo.maven.apache.org/maven2/org/apache/maven/wagon/wagon-provider-api/1.0-beta-4/wagon-provider-api-1.0-beta-4.jar (51 KB at 38.6 KB/sec)
      Downloaded: http://repo.maven.apache.org/maven2/org/apache/maven/maven-compat/3.0-alpha-2/maven-compat-3.0-alpha-2.jar (233 KB at 123.8 KB/sec)
      [INFO]
      [INFO] — maven-clean-plugin:2.5:clean (default-clean) @ onlab-rest —
      [INFO]
      [INFO] — jacoco-maven-plugin:0.7.5.201505241946:prepare-agent (default-prepare-agent) @ onlab-rest —
      [INFO] argLine set to -javaagent:/home/root1/.m2/repository/org/jacoco/org.jacoco.agent/0.7.5.201505241946/org.jacoco.agent-0.7.5.201505241946-runtime.jar=destfile=/opt/onos-master/onos/utils/test/target/jacoco.exec -Duser.language=en -Duser.region=US
      [INFO]
      [INFO] — yangutils-maven-plugin:1.0.0-SNAPSHOT:yang2java (default) @ onlab-rest —
      [INFO] ------------------------------------------------------------------------
      [INFO] BUILD FAILURE
      [INFO] ------------------------------------------------------------------------
      [INFO] Total time: 3.859 s
      [INFO] Finished at: 2016-05-12T18:27:35+05:30
      [INFO] Final Memory: 23M/249M
      [INFO] ------------------------------------------------------------------------
      [ERROR] Failed to execute goal org.onosproject:yangutils-maven-plugin:1.0.0-SNAPSHOT:yang2java (default) on project onlab-rest: Execution default of goal org.onosproject:yangutils-maven-plugin:1.0.0-SNAPSHOT:yang2java failed. NullPointerException -> [Help 1]
      [ERROR]
      [ERROR] To see the full stack trace of the errors, re-run Maven with the -e switch.
      [ERROR] Re-run Maven using the -X switch to enable full debug logging.
      [ERROR]
      [ERROR] For more information about the errors and possible solutions, please read the following articles:
      [ERROR] [Help 1] http://cwiki.apache.org/confluence/display/MAVEN/PluginExecutionException

        Attachments

        No reviews matched the request. Check your Options in the drop-down menu of this sections header.

          Activity

            People

            • Assignee:
              bsaraswal bharat saraswal
              Reporter:
              huawei-adarsh Adarsh m
            • Votes:
              0 Vote for this issue
              Watchers:
              2 Start watching this issue

              Dates

              • Created:
                Updated:
                Resolved: