Uploaded image for project: 'ONOS'
  1. ONOS
  2. ONOS-4564

build failure for bits

    XMLWordPrintable

    Details

    • Type: Bug
    • Status: Closed (View Workflow)
    • Priority: Major
    • Resolution: Done
    • Affects Version/s: None
    • Fix Version/s: 1.6.0
    • Component/s: None
    • Environment:

      ONOS BUILD

    • Story Points:
      3

      Description

      typedef type15 {
      type bits {
      bit disable-nagle

      { position 0; }

      bit auto-sense-speed

      { position 1; }

      bit 10-Mb-only

      { position 2; }

      }
      }

      Log:
      [INFO] Error in file: /home/root1/onos/utils/test/src/main/yang/missed_states.yang
      Internal parser error detected: Invalid holder for type "bits" before processing.
      [INFO] ------------------------------------------------------------------------
      [INFO] BUILD FAILURE
      [INFO] ------------------------------------------------------------------------
      [INFO] Total time: 2.858 s
      [INFO] Finished at: 2016-05-19T16:41:56+05:30
      [INFO] Final Memory: 19M/310M
      [INFO] ------------------------------------------------------------------------
      [ERROR] Failed to execute goal org.onosproject:yangutils-maven-plugin:1.0.0-SNAPSHOT:yang2java (default) on project onlab-test: Exception occured due to Internal parser error detected: Invalid holder for type "bits" before processing. in /home/root1/onos/utils/test/src/main/yang/missed_states.yang YANG file. -> [Help 1]
      org.apache.maven.lifecycle.LifecycleExecutionException: Failed to execute goal org.onosproject:yangutils-maven-plugin:1.0.0-SNAPSHOT:yang2java (default) on project onlab-test: Exception occured due to Internal parser error detected: Invalid holder for type "bits" before processing. in /home/root1/onos/utils/test/src/main/yang/missed_states.yang YANG file.
      at org.apache.maven.lifecycle.internal.MojoExecutor.execute(MojoExecutor.java:216)
      at org.apache.maven.lifecycle.internal.MojoExecutor.execute(MojoExecutor.java:153)
      at org.apache.maven.lifecycle.internal.MojoExecutor.execute(MojoExecutor.java:145)
      at org.apache.maven.lifecycle.internal.LifecycleModuleBuilder.buildProject(LifecycleModuleBuilder.java:116)
      at org.apache.maven.lifecycle.internal.LifecycleModuleBuilder.buildProject(LifecycleModuleBuilder.java:80)
      at org.apache.maven.lifecycle.internal.builder.singlethreaded.SingleThreadedBuilder.build(SingleThreadedBuilder.java:51)
      at org.apache.maven.lifecycle.internal.LifecycleStarter.execute(LifecycleStarter.java:128)
      at org.apache.maven.DefaultMaven.doExecute(DefaultMaven.java:307)
      at org.apache.maven.DefaultMaven.doExecute(DefaultMaven.java:193)
      at org.apache.maven.DefaultMaven.execute(DefaultMaven.java:106)
      at org.apache.maven.cli.MavenCli.execute(MavenCli.java:862)
      at org.apache.maven.cli.MavenCli.doMain(MavenCli.java:286)
      at org.apache.maven.cli.MavenCli.main(MavenCli.java:197)
      at sun.reflect.NativeMethodAccessorImpl.invoke0(Native Method)
      at sun.reflect.NativeMethodAccessorImpl.invoke(NativeMethodAccessorImpl.java:62)
      at sun.reflect.DelegatingMethodAccessorImpl.invoke(DelegatingMethodAccessorImpl.java:43)
      at java.lang.reflect.Method.invoke(Method.java:498)
      at org.codehaus.plexus.classworlds.launcher.Launcher.launchEnhanced(Launcher.java:289)
      at org.codehaus.plexus.classworlds.launcher.Launcher.launch(Launcher.java:229)
      at org.codehaus.plexus.classworlds.launcher.Launcher.mainWithExitCode(Launcher.java:415)
      at org.codehaus.plexus.classworlds.launcher.Launcher.main(Launcher.java:356)
      Caused by: org.apache.maven.plugin.MojoExecutionException: Exception occured due to Internal parser error detected: Invalid holder for type "bits" before processing. in /home/root1/onos/utils/test/src/main/yang/missed_states.yang YANG file.
      at org.onosproject.yangutils.plugin.manager.YangUtilManager.execute(YangUtilManager.java:190)
      at org.apache.maven.plugin.DefaultBuildPluginManager.executeMojo(DefaultBuildPluginManager.java:134)
      at org.apache.maven.lifecycle.internal.MojoExecutor.execute(MojoExecutor.java:208)
      ... 20 more
      [ERROR]
      [ERROR]
      [ERROR] For more information about the errors and possible solutions, please read the following articles:
      [ERROR] [Help 1] http://cwiki.apache.org/confluence/display/MAVEN/MojoExecutionException
      root1@root1-HP-EliteBook-840-G2:~/onos/utils/test$

        Attachments

        No reviews matched the request. Check your Options in the drop-down menu of this sections header.

          Activity

            People

            • Assignee:
              Vidyashree-Huawei Vidyashree Rama
              Reporter:
              sathishmurugesan sathishkumar murugesan
            • Votes:
              0 Vote for this issue
              Watchers:
              2 Start watching this issue

              Dates

              • Created:
                Updated:
                Resolved: