Uploaded image for project: 'ONOS'
  1. ONOS
  2. ONOS-4601

yang utils error info is not ok. not showing the specific reason. pyang givng the specific reason

    XMLWordPrintable

    Details

    • Type: Bug
    • Status: Closed (View Workflow)
    • Priority: Minor
    • Resolution: Fixed
    • Affects Version/s: 1.7.0
    • Fix Version/s: 1.7.0
    • Component/s: None
    • Environment:

      ONOS BUILD

    • Story Points:
      2

      Description

      yang:
      leaf eleven {
      type union

      { /*type int8; type int16; type int32; type int64; type uint8; type uint16; type uint32; type uint64; type string; type binary;*/ type union; //type boolean; }

      }

      pyang output:
      home/root1/onos/utils/test/src/main/yang/leaf.yang:99: error: a type union must have at least one type statement

      [INFO] Scanning for projects...
      [INFO]
      [INFO] ------------------------------------------------------------------------
      [INFO] Building onlab-test 1.6.0-SNAPSHOT
      [INFO] ------------------------------------------------------------------------
      [INFO]
      [INFO] — maven-clean-plugin:2.5:clean (default-clean) @ onlab-test —
      [INFO]
      [INFO] — jacoco-maven-plugin:0.7.5.201505241946:prepare-agent (default-prepare-agent) @ onlab-test —
      [INFO] argLine set to -javaagent:/root/.m2/repository/org/jacoco/org.jacoco.agent/0.7.5.201505241946/org.jacoco.agent-0.7.5.201505241946-runtime.jar=destfile=/home/root1/onos/utils/test/target/jacoco.exec -Duser.language=en -Duser.region=US
      [INFO]
      [INFO] — yangutils-maven-plugin:1.0.0-SNAPSHOT:yang2java (default) @ onlab-test —
      [INFO] ------------------------------------------------------------------------
      [INFO] BUILD FAILURE
      [INFO] ------------------------------------------------------------------------
      [INFO] Total time: 2.618 s
      [INFO] Finished at: 2016-05-23T18:16:23+05:30
      [INFO] Final Memory: 19M/307M
      [INFO] ------------------------------------------------------------------------
      [ERROR] Failed to execute goal org.onosproject:yangutils-maven-plugin:1.0.0-SNAPSHOT:yang2java (default) on project onlab-test: Exception occured due to null in /home/root1/onos/utils/test/src/main/yang/leaf.yang YANG file. -> [Help 1]
      [ERROR]
      [ERROR] To see the full stack trace of the errors, re-run Maven with the -e switch.
      [ERROR] Re-run Maven using the -X switch to enable full debug logging.
      [ERROR]
      [ERROR] For more information about the errors and possible solutions, please read the following articles:
      [ERROR] [Help 1] http://cwiki.apache.org/confluence/display/MAVEN/MojoExecutionException
      0
      /home

        Attachments

        No reviews matched the request. Check your Options in the drop-down menu of this sections header.

          Activity

            People

            Assignee:
            Vidyashree-Huawei Vidyashree Rama
            Reporter:
            sathishmurugesan sathishkumar murugesan
            Votes:
            0 Vote for this issue
            Watchers:
            2 Start watching this issue

              Dates

              Created:
              Updated:
              Resolved: