Uploaded image for project: 'ONOS'
  1. ONOS
  2. ONOS-4888

Cannot find symbol error occurring for grouping and uses feature.

    XMLWordPrintable

    Details

    • Type: Bug
    • Status: Closed (View Workflow)
    • Priority: Major
    • Resolution: Done
    • Affects Version/s: None
    • Fix Version/s: 1.7.0
    • Component/s: None
    • Labels:
      None
    • Story Points:
      7

      Description

      Defect : Cannot find symbol error occurring for grouping and uses feature.

      Logs :
      location: class ModuletestManager
      /opt/onos-master/onos/utils/test/src/main/java/org/onosproject/yang/gen/v1/onos/yang/yangautoprefix16/level1/newlevel/rev20150205/ModuletestManager.java:[69,25] error: cannot find symbol
      [ERROR] symbol: class Cont1
      location: class ModuletestManager
      /opt/onos-master/onos/utils/test/src/main/java/org/onosproject/yang/gen/v1/onos/yang/yangautoprefix16/level1/newlevel/rev20150205/ModuletestService.java:[33,9] error: cannot find symbol
      [ERROR] symbol: class Person
      location: interface ModuletestService
      /opt/onos-master/onos/utils/test/src/main/java/org/onosproject/yang/gen/v1/onos/yang/yangautoprefix16/level1/newlevel/rev20150205/ModuletestService.java:[40,4] error: cannot find symbol
      [ERROR] symbol: class Cont1
      location: interface ModuletestService
      /opt/onos-master/onos/utils/test/src/main/java/org/onosproject/yang/gen/v1/onos/yang/yangautoprefix16/level1/newlevel/rev20150205/ModuletestService.java:[47,24] error: cannot find symbol
      [ERROR] symbol: class Person
      location: interface ModuletestService
      /opt/onos-master/onos/utils/test/src/main/java/org/onosproject/yang/gen/v1/onos/yang/yangautoprefix16/level1/newlevel/rev20150205/ModuletestService.java:[54,18] error: cannot find symbol
      [ERROR] symbol: class Cont1
      location: interface ModuletestService
      /opt/onos-master/onos/utils/test/src/main/java/org/onosproject/yang/gen/v1/onos/yang/yangautoprefix15/level1/newlevel/rev20150205/ModuletestManager.java:[24,100] error: package org.onosproject.yang.gen.v1.onos.yang.yangautoprefix15.level1.newlevel.rev20150205.moduletest does not exist
      [ERROR] /opt/onos-master/onos/utils/test/src/main/java/org/onosproject/yang/gen/v1/onos/yang/yangautoprefix15/level1/newlevel/rev20150205/ModuletestManager.java:[25,100] error: package org.onosproject.yang.gen.v1.onos.yang.yangautoprefix15.level1.newlevel.rev20150205.moduletest does not exist
      [ERROR] /opt/onos-master/onos/utils/test/src/main/java/org/onosproject/yang/gen/v1/onos/yang/yangautoprefix15/level1/newlevel/rev20150205/ModuletestManager.java:[52,16] error: cannot find symbol
      [ERROR] symbol: class Person
      location: class ModuletestManager
      /opt/onos-master/onos/utils/test/src/main/java/org/onosproject/yang/gen/v1/onos/yang/yangautoprefix15/level1/newlevel/rev20150205/ModuletestManager.java:[58,16] error: cannot find symbol
      [ERROR] symbol: class OfficialDetails
      location: class ModuletestManager
      /opt/onos-master/onos/utils/test/src/main/java/org/onosproject/yang/gen/v1/onos/yang/yangautoprefix15/level1/newlevel/rev20150205/ModuletestManager.java:[64,31] error: cannot find symbol
      [ERROR] symbol: class Person
      location: class ModuletestManager
      /opt/onos-master/onos/utils/test/src/main/java/org/onosproject/yang/gen/v1/onos/yang/yangautoprefix15/level1/newlevel/rev20150205/ModuletestManager.java:[69,40] error: cannot find symbol
      [ERROR] symbol: class OfficialDetails
      location: class ModuletestManager
      /opt/onos-master/onos/utils/test/src/main/java/org/onosproject/yang/gen/v1/onos/yang/yangautoprefix7/level1/newlevel/rev20150205/ModuletestService.java:[19,99] error: package org.onosproject.yang.gen.v1.onos.yang.yangautoprefix7.level1.newlevel.rev20150205.moduletest does not exist
      [ERROR] /opt/onos-master/onos/utils/test/src/main/java/org/onosproject/yang/gen/v1/onos/yang/yangautoprefix7/level1/newlevel/rev20150205/ModuletestService.java:[31,4] error: cannot find symbol
      [ERROR] symbol: class Cont1
      location: interface ModuletestService
      /opt/onos-master/onos/utils/test/src/main/java/org/onosproject/yang/gen/v1/onos/yang/yangautoprefix7/level1/newlevel/rev20150205/ModuletestService.java:[38,18] error: cannot find symbol
      [ERROR] symbol: class Cont1
      location: interface ModuletestService
      /opt/onos-master/onos/utils/test/src/main/java/org/onosproject/yang/gen/v1/onos/yang/yangautoprefix11/level1/newlevel/rev20150205/ModuletestManager.java:[23,100] error: package org.onosproject.yang.gen.v1.onos.yang.yangautoprefix11.level1.newlevel.rev20150205.moduletest does not exist
      [ERROR] /opt/onos-master/onos/utils/test/src/main/java/org/onosproject/yang/gen/v1/onos/yang/yangautoprefix11/level1/newlevel/rev20150205/ModuletestService.java:[19,100] error: package org.onosproject.yang.gen.v1.onos.yang.yangautoprefix11.level1.newlevel.rev20150205.moduletest does not exist
      [ERROR] /opt/onos-master/onos/utils/test/src/main/java/org/onosproject/yang/gen/v1/onos/yang/yangautoprefix11/level1/newlevel/rev20150205/ModuletestManager.java:[50,11] error: cannot find symbol
      [ERROR] symbol: class Cont1
      location: class ModuletestManager
      /opt/onos-master/onos/utils/test/src/main/java/org/onosproject/yang/gen/v1/onos/yang/yangautoprefix11/level1/newlevel/rev20150205/ModuletestManager.java:[56,25] error: cannot find symbol
      [ERROR] symbol: class Cont1
      location: class ModuletestManager
      /opt/onos-master/onos/utils/test/src/main/java/org/onosproject/yang/gen/v1/onos/yang/yangautoprefix11/level1/newlevel/rev20150205/ModuletestService.java:[31,4] error: cannot find symbol
      [ERROR] symbol: class Cont1
      location: interface ModuletestService
      /opt/onos-master/onos/utils/test/src/main/java/org/onosproject/yang/gen/v1/onos/yang/yangautoprefix11/level1/newlevel/rev20150205/ModuletestService.java:[38,18] error: cannot find symbol
      [ERROR] symbol: class Cont1
      location: interface ModuletestService
      /opt/onos-master/onos/utils/test/src/main/java/org/onosproject/yang/gen/v1/onos/yang/yangautoprefix20/keyless/level1/newlevel/rev20150205/ModuletestManager.java:[24,108] error: package org.onosproject.yang.gen.v1.onos.yang.yangautoprefix20.keyless.level1.newlevel.rev20150205.moduletest does not exist
      [ERROR] /opt/onos-master/onos/utils/test/src/main/java/org/onosproject/yang/gen/v1/onos/yang/yangautoprefix20/keyless/level1/newlevel/rev20150205/ModuletestService.java:[20,108] error: package org.onosproject.yang.gen.v1.onos.yang.yangautoprefix20.keyless.level1.newlevel.rev20150205.moduletest does not exist
      [ERROR] /opt/onos-master/onos/utils/test/src/main/java/org/onosproject/yang/gen/v1/onos/yang/yangautoprefix20/keyless/level1/newlevel/rev20150205/ModuletestManager.java:[51,16] error: cannot find symbol
      [ERROR] symbol: class Person
      location: class ModuletestManager
      /opt/onos-master/onos/utils/test/src/main/java/org/onosproject/yang/gen/v1/onos/yang/yangautoprefix20/keyless/level1/newlevel/rev20150205/ModuletestManager.java:[57,31] error: cannot find symbol
      [ERROR] symbol: class Person
      location: class ModuletestManager
      /opt/onos-master/onos/utils/test/src/main/java/org/onosproject/yang/gen/v1/onos/yang/yangautoprefix20/keyless/level1/newlevel/rev20150205/ModuletestService.java:[32,9] error: cannot find symbol
      [ERROR] symbol: class Person
      location: interface ModuletestService
      /opt/onos-master/onos/utils/test/src/main/java/org/onosproject/yang/gen/v1/onos/yang/yangautoprefix20/keyless/level1/newlevel/rev20150205/ModuletestService.java:[39,24] error: cannot find symbol
      [ERROR] symbol: class Person
      location: interface ModuletestService
      /opt/onos-master/onos/utils/test/src/main/java/org/onosproject/yang/gen/v1/onos/yang/yangautoprefix7/level1/newlevel/rev20150205/ModuletestManager.java:[23,99] error: package org.onosproject.yang.gen.v1.onos.yang.yangautoprefix7.level1.newlevel.rev20150205.moduletest does not exist
      [ERROR] /opt/onos-master/onos/utils/test/src/main/java/org/onosproject/yang/gen/v1/onos/yang/yangautoprefix7/level1/newlevel/rev20150205/ModuletestManager.java:[50,11] error: cannot find symbol
      [ERROR] symbol: class Cont1
      location: class ModuletestManager
      /opt/onos-master/onos/utils/test/src/main/java/org/onosproject/yang/gen/v1/onos/yang/yangautoprefix7/level1/newlevel/rev20150205/ModuletestManager.java:[56,25] error: cannot find symbol
      [ERROR] symbol: class Cont1
      location: class ModuletestManager
      /opt/onos-master/onos/utils/test/src/main/java/org/onosproject/yang/gen/v1/onos/yang/yangautoprefix13/level1/newlevel/rev20150205/ModuletestService.java:[20,100] error: package org.onosproject.yang.gen.v1.onos.yang.yangautoprefix13.level1.newlevel.rev20150205.moduletest does not exist
      [ERROR] /opt/onos-master/onos/utils/test/src/main/java/org/onosproject/yang/gen/v1/onos/yang/yangautoprefix13/level1/newlevel/rev20150205/ModuletestService.java:[32,9] error: cannot find symbol
      [ERROR] symbol: class Person
      location: interface ModuletestService
      /opt/onos-master/onos/utils/test/src/main/java/org/onosproject/yang/gen/v1/onos/yang/yangautoprefix13/level1/newlevel/rev20150205/ModuletestService.java:[39,24] error: cannot find symbol
      [ERROR] symbol: class Person
      location: interface ModuletestService
      /opt/onos-master/onos/utils/test/src/main/java/org/onosproject/yang/gen/v1/onos/yang/yangautoprefix18/level1/newlevel/rev20150205/ModuletestManager.java:[23,100] error: package org.onosproject.yang.gen.v1.onos.yang.yangautoprefix18.level1.newlevel.rev20150205.moduletest does not exist
      [ERROR] /opt/onos-master/onos/utils/test/src/main/java/org/onosproject/yang/gen/v1/onos/yang/yangautoprefix18/level1/newlevel/rev20150205/ModuletestManager.java:[56,11] error: cannot find symbol
      [ERROR] symbol: class Cont1
      location: class ModuletestManager
      /opt/onos-master/onos/utils/test/src/main/java/org/onosproject/yang/gen/v1/onos/yang/yangautoprefix18/level1/newlevel/rev20150205/ModuletestManager.java:[67,25] error: cannot find symbol
      [ERROR] symbol: class Cont1
      location: class ModuletestManager
      /opt/onos-master/onos/utils/test/src/main/java/org/onosproject/yang/gen/v1/onos/yang/yangautoprefix20/level1/newlevel/rev20150205/ModuletestManager.java:[24,100] error: package org.onosproject.yang.gen.v1.onos.yang.yangautoprefix20.level1.newlevel.rev20150205.moduletest does not exist
      [ERROR] /opt/onos-master/onos/utils/test/src/main/java/org/onosproject/yang/gen/v1/onos/yang/yangautoprefix20/level1/newlevel/rev20150205/ModuletestManager.java:[51,16] error: cannot find symbol
      [ERROR] symbol: class Person
      location: class ModuletestManager
      /opt/onos-master/onos/utils/test/src/main/java/org/onosproject/yang/gen/v1/onos/yang/yangautoprefix20/level1/newlevel/rev20150205/ModuletestManager.java:[57,31] error: cannot find symbol
      [ERROR] symbol: class Person
      location: class ModuletestManager
      /opt/onos-master/onos/utils/test/src/main/java/org/onosproject/yang/gen/v1/onos/yang/yangautoprefix13/level1/newlevel/rev20150205/ModuletestManager.java:[24,100] error: package org.onosproject.yang.gen.v1.onos.yang.yangautoprefix13.level1.newlevel.rev20150205.moduletest does not exist
      [ERROR] /opt/onos-master/onos/utils/test/src/main/java/org/onosproject/yang/gen/v1/onos/yang/yangautoprefix13/level1/newlevel/rev20150205/ModuletestManager.java:[51,16] error: cannot find symbol
      [ERROR] symbol: class Person
      location: class ModuletestManager
      /opt/onos-master/onos/utils/test/src/main/java/org/onosproject/yang/gen/v1/onos/yang/yangautoprefix13/level1/newlevel/rev20150205/ModuletestManager.java:[57,31] error: cannot find symbol
      [INFO] 96 errors
      [INFO] -------------------------------------------------------------
      [INFO] ------------------------------------------------------------------------
      [INFO] BUILD FAILURE
      [INFO] ------------------------------------------------------------------------
      [INFO] Total time: 3.165 s
      [INFO] Finished at: 2016-07-10T21:46:57+05:30
      [INFO] Final Memory: 29M/319M
      [INFO] ------------------------------------------------------------------------
      [ERROR] Failed to execute goal org.apache.maven.plugins:maven-compiler-plugin:2.5.1:compile (default-compile) on project onlab-test: Compilation failure: Compilation failure:
      [ERROR] /opt/onos-master/onos/utils/test/src/main/java/org/onosproject/yang/gen/v1/onos/yang/yangautoprefix20/level1/newlevel/rev20150205/ModuletestService.java:[20,100] error: package org.onosproject.yang.gen.v1.onos.yang.yangautoprefix20.level1.newlevel.rev20150205.moduletest does not exist
      [ERROR] /opt/onos-master/onos/utils/test/src/main/java/org/onosproject/yang/gen/v1/onos/yang/yangautoprefix20/level1/newlevel/rev20150205/ModuletestService.java:[32,9] error: cannot find symbol
      [ERROR] symbol: class Person
      [ERROR] location: interface ModuletestService
      [ERROR] /opt/onos-master/onos/utils/test/src/main/java/org/onosproject/yang/gen/v1/onos/yang/yangautoprefix20/level1/newlevel/rev20150205/ModuletestService.java:[39,24] error: cannot find symbol
      [ERROR] symbol: class Person
      [ERROR] location: interface ModuletestService
      [ERROR] /opt/onos-master/onos/utils/test/src/main/java/org/onosproject/yang/gen/v1/onos/yang/yangautoprefix10/level1/newlevel/rev20150205/ModuletestManager.java:[23,100] error: package org.onosproject.yang.gen.v1.onos.yang.yangautoprefix10.level1.newlevel.rev20150205.moduletest does not exist
      [ERROR] /opt/onos-master/onos/utils/test/src/main/java/org/onosproject/yang/gen/v1/onos/yang/yangautoprefix10/level1/newlevel/rev20150205/ModuletestService.java:[19,100] error: package org.onosproject.yang.gen.v1.onos.yang.yangautoprefix10.level1.newlevel.rev20150205.moduletest does not exist
      [ERROR] /opt/onos-master/onos/utils/test/src/main/java/org/onosproject/yang/gen/v1/onos/yang/yangautoprefix10/level1/newlevel/rev20150205/ModuletestManager.java:[50,11] error: cannot find symbol
      [ERROR] symbol: class ContA1
      [ERROR] location: class ModuletestManager
      [ERROR] /opt/onos-master/onos/utils/test/src/main/java/org/onosproject/yang/gen/v1/onos/yang/yangautoprefix10/level1/newlevel/rev20150205/ModuletestManager.java:[56,26] error: cannot find symbol
      [ERROR] symbol: class ContA1
      [ERROR] location: class ModuletestManager
      [ERROR] /opt/onos-master/onos/utils/test/src/main/java/org/onosproject/yang/gen/v1/onos/yang/yangautoprefix10/level1/newlevel/rev20150205/ModuletestService.java:[31,4] error: cannot find symbol
      [ERROR] symbol: class ContA1
      [ERROR] location: interface ModuletestService
      [ERROR] /opt/onos-master/onos/utils/test/src/main/java/org/onosproject/yang/gen/v1/onos/yang/yangautoprefix10/level1/newlevel/rev20150205/ModuletestService.java:[38,19] error: cannot find symbol
      [ERROR] symbol: class ContA1
      [ERROR] location: interface ModuletestService
      [ERROR] /opt/onos-master/onos/utils/test/src/main/java/org/onosproject/yang/gen/v1/onos/yang/yangautoprefix18/level1/newlevel/rev20150205/ModuletestService.java:[19,100] error: package org.onosproject.yang.gen.v1.onos.yang.yangautoprefix18.level1.newlevel.rev20150205.moduletest does not exist
      [ERROR] /opt/onos-master/onos/utils/test/src/main/java/org/onosproject/yang/gen/v1/onos/yang/yangautoprefix18/level1/newlevel/rev20150205/ModuletestService.java:[38,4] error: cannot find symbol
      [ERROR] symbol: class Cont1
      [ERROR] location: interface ModuletestService
      [ERROR] /opt/onos-master/onos/utils/test/src/main/java/org/onosproject/yang/gen/v1/onos/yang/yangautoprefix18/level1/newlevel/rev20150205/ModuletestService.java:[52,18] error: cannot find symbol
      [ERROR] symbol: class Cont1
      [ERROR] location: interface ModuletestService
      [ERROR] /opt/onos-master/onos/utils/test/src/main/java/org/onosproject/yang/gen/v1/onos/yang/yangautoprefix14/level1/newlevel/rev20150205/ModuletestManager.java:[24,100] error: package org.onosproject.yang.gen.v1.onos.yang.yangautoprefix14.level1.newlevel.rev20150205.moduletest does not exist
      [ERROR] /opt/onos-master/onos/utils/test/src/main/java/org/onosproject/yang/gen/v1/onos/yang/yangautoprefix14/level1/newlevel/rev20150205/ModuletestService.java:[20,100] error: package org.onosproject.yang.gen.v1.onos.yang.yangautoprefix14.level1.newlevel.rev20150205.moduletest does not exist
      [ERROR] /opt/onos-master/onos/utils/test/src/main/java/org/onosproject/yang/gen/v1/onos/yang/yangautoprefix14/level1/newlevel/rev20150205/ModuletestManager.java:[51,16] error: cannot find symbol
      [ERROR] symbol: class Person
      [ERROR] location: class ModuletestManager
      [ERROR] /opt/onos-master/onos/utils/test/src/main/java/org/onosproject/yang/gen/v1/onos/yang/yangautoprefix14/level1/newlevel/rev20150205/ModuletestManager.java:[57,31] error: cannot find symbol
      [ERROR] symbol: class Person
      [ERROR] location: class ModuletestManager
      [ERROR] /opt/onos-master/onos/utils/test/src/main/java/org/onosproject/yang/gen/v1/onos/yang/yangautoprefix14/level1/newlevel/rev20150205/ModuletestService.java:[32,9] error: cannot find symbol
      [ERROR] symbol: class Person
      [ERROR] location: interface ModuletestService
      [ERROR] /opt/onos-master/onos/utils/test/src/main/java/org/onosproject/yang/gen/v1/onos/yang/yangautoprefix14/level1/newlevel/rev20150205/ModuletestService.java:[39,24] error: cannot find symbol
      [ERROR] symbol: class Person
      [ERROR] location: interface ModuletestService
      [ERROR] /opt/onos-master/onos/utils/test/src/main/java/org/onosproject/yang/gen/v1/onos/yang/yangautoprefix8/level1/newlevel/rev20150205/ModuletestService.java:[19,99] error: package org.onosproject.yang.gen.v1.onos.yang.yangautoprefix8.level1.newlevel.rev20150205.moduletest does not exist
      [ERROR] /opt/onos-master/onos/utils/test/src/main/java/org/onosproject/yang/gen/v1/onos/yang/yangautoprefix8/level1/newlevel/rev20150205/ModuletestService.java:[31,4] error: cannot find symbol
      [ERROR] symbol: class Cont1
      [ERROR] location: interface ModuletestService
      [ERROR] /opt/onos-master/onos/utils/test/src/main/java/org/onosproject/yang/gen/v1/onos/yang/yangautoprefix8/level1/newlevel/rev20150205/ModuletestService.java:[38,18] error: cannot find symbol
      [ERROR] symbol: class Cont1
      [ERROR] location: interface ModuletestService
      [ERROR] /opt/onos-master/onos/utils/test/src/main/java/org/onosproject/yang/gen/v1/onos/yang/yangautoprefix12/level1/newlevel/rev20150205/ModuletestManager.java:[24,100] error: package org.onosproject.yang.gen.v1.onos.yang.yangautoprefix12.level1.newlevel.rev20150205.moduletest does not exist
      [ERROR] /opt/onos-master/onos/utils/test/src/main/java/org/onosproject/yang/gen/v1/onos/yang/yangautoprefix12/level1/newlevel/rev20150205/ModuletestService.java:[20,100] error: package org.onosproject.yang.gen.v1.onos.yang.yangautoprefix12.level1.newlevel.rev20150205.moduletest does not exist
      [ERROR] /opt/onos-master/onos/utils/test/src/main/java/org/onosproject/yang/gen/v1/onos/yang/yangautoprefix12/level1/newlevel/rev20150205/ModuletestManager.java:[51,16] error: cannot find symbol
      [ERROR] symbol: class Person
      [ERROR] location: class ModuletestManager
      [ERROR] /opt/onos-master/onos/utils/test/src/main/java/org/onosproject/yang/gen/v1/onos/yang/yangautoprefix12/level1/newlevel/rev20150205/ModuletestManager.java:[57,31] error: cannot find symbol
      [ERROR] symbol: class Person
      [ERROR] location: class ModuletestManager
      [ERROR] /opt/onos-master/onos/utils/test/src/main/java/org/onosproject/yang/gen/v1/onos/yang/yangautoprefix12/level1/newlevel/rev20150205/ModuletestService.java:[32,9] error: cannot find symbol
      [ERROR] symbol: class Person
      [ERROR] location: interface ModuletestService
      [ERROR] /opt/onos-master/onos/utils/test/src/main/java/org/onosproject/yang/gen/v1/onos/yang/yangautoprefix12/level1/newlevel/rev20150205/ModuletestService.java:[39,24] error: cannot find symbol
      [ERROR] symbol: class Person
      [ERROR] location: interface ModuletestService
      [ERROR] /opt/onos-master/onos/utils/test/src/main/java/org/onosproject/yang/gen/v1/onos/yang/yangautoprefix19/level1/newlevel/rev20150205/ModuletestManager.java:[23,100] error: package org.onosproject.yang.gen.v1.onos.yang.yangautoprefix19.level1.newlevel.rev20150205.moduletest does not exist
      [ERROR] /opt/onos-master/onos/utils/test/src/main/java/org/onosproject/yang/gen/v1/onos/yang/yangautoprefix19/level1/newlevel/rev20150205/ModuletestService.java:[19,100] error: package org.onosproject.yang.gen.v1.onos.yang.yangautoprefix19.level1.newlevel.rev20150205.moduletest does not exist
      [ERROR] /opt/onos-master/onos/utils/test/src/main/java/org/onosproject/yang/gen/v1/onos/yang/yangautoprefix19/level1/newlevel/rev20150205/ModuletestManager.java:[50,11] error: cannot find symbol
      [ERROR] symbol: class Cont1
      [ERROR] location: class ModuletestManager
      [ERROR] /opt/onos-master/onos/utils/test/src/main/java/org/onosproject/yang/gen/v1/onos/yang/yangautoprefix19/level1/newlevel/rev20150205/ModuletestManager.java:[56,25] error: cannot find symbol
      [ERROR] symbol: class Cont1
      [ERROR] location: class ModuletestManager
      [ERROR] /opt/onos-master/onos/utils/test/src/main/java/org/onosproject/yang/gen/v1/onos/yang/yangautoprefix19/level1/newlevel/rev20150205/ModuletestService.java:[31,4] error: cannot find symbol
      [ERROR] symbol: class Cont1
      [ERROR] location: interface ModuletestService
      [ERROR] /opt/onos-master/onos/utils/test/src/main/java/org/onosproject/yang/gen/v1/onos/yang/yangautoprefix19/level1/newlevel/rev20150205/ModuletestService.java:[38,18] error: cannot find symbol
      [ERROR] symbol: class Cont1
      [ERROR] location: interface ModuletestService
      [ERROR] /opt/onos-master/onos/utils/test/src/main/java/org/onosproject/yang/gen/v1/onos/yang/yangautoprefix9/level1/newlevel/rev20150205/ModuletestManager.java:[23,99] error: package org.onosproject.yang.gen.v1.onos.yang.yangautoprefix9.level1.newlevel.rev20150205.moduletest does not exist
      [ERROR] /opt/onos-master/onos/utils/test/src/main/java/org/onosproject/yang/gen/v1/onos/yang/yangautoprefix9/level1/newlevel/rev20150205/ModuletestService.java:[19,99] error: package org.onosproject.yang.gen.v1.onos.yang.yangautoprefix9.level1.newlevel.rev20150205.moduletest does not exist
      [ERROR] /opt/onos-master/onos/utils/test/src/main/java/org/onosproject/yang/gen/v1/onos/yang/yangautoprefix9/level1/newlevel/rev20150205/ModuletestManager.java:[50,11] error: cannot find symbol
      [ERROR] symbol: class Cont1
      [ERROR] location: class ModuletestManager
      [ERROR] /opt/onos-master/onos/utils/test/src/main/java/org/onosproject/yang/gen/v1/onos/yang/yangautoprefix9/level1/newlevel/rev20150205/ModuletestManager.java:[56,25] error: cannot find symbol
      [ERROR] symbol: class Cont1
      [ERROR] location: class ModuletestManager
      [ERROR] /opt/onos-master/onos/utils/test/src/main/java/org/onosproject/yang/gen/v1/onos/yang/yangautoprefix9/level1/newlevel/rev20150205/ModuletestService.java:[31,4] error: cannot find symbol
      [ERROR] symbol: class Cont1
      [ERROR] location: interface ModuletestService
      [ERROR] /opt/onos-master/onos/utils/test/src/main/java/org/onosproject/yang/gen/v1/onos/yang/yangautoprefix9/level1/newlevel/rev20150205/ModuletestService.java:[38,18] error: cannot find symbol
      [ERROR] symbol: class Cont1
      [ERROR] location: interface ModuletestService
      [ERROR] /opt/onos-master/onos/utils/test/src/main/java/org/onosproject/yang/gen/v1/onos/yang/yangautoprefix8/level1/newlevel/rev20150205/ModuletestManager.java:[23,99] error: package org.onosproject.yang.gen.v1.onos.yang.yangautoprefix8.level1.newlevel.rev20150205.moduletest does not exist
      [ERROR] /opt/onos-master/onos/utils/test/src/main/java/org/onosproject/yang/gen/v1/onos/yang/yangautoprefix8/level1/newlevel/rev20150205/ModuletestManager.java:[50,11] error: cannot find symbol
      [ERROR] symbol: class Cont1
      [ERROR] location: class ModuletestManager
      [ERROR] /opt/onos-master/onos/utils/test/src/main/java/org/onosproject/yang/gen/v1/onos/yang/yangautoprefix8/level1/newlevel/rev20150205/ModuletestManager.java:[56,25] error: cannot find symbol
      [ERROR] symbol: class Cont1
      [ERROR] location: class ModuletestManager
      [ERROR] /opt/onos-master/onos/utils/test/src/main/java/org/onosproject/yang/gen/v1/onos/yang/yangautoprefix15/level1/newlevel/rev20150205/ModuletestService.java:[20,100] error: package org.onosproject.yang.gen.v1.onos.yang.yangautoprefix15.level1.newlevel.rev20150205.moduletest does not exist
      [ERROR] /opt/onos-master/onos/utils/test/src/main/java/org/onosproject/yang/gen/v1/onos/yang/yangautoprefix15/level1/newlevel/rev20150205/ModuletestService.java:[21,100] error: package org.onosproject.yang.gen.v1.onos.yang.yangautoprefix15.level1.newlevel.rev20150205.moduletest does not exist
      [ERROR] /opt/onos-master/onos/utils/test/src/main/java/org/onosproject/yang/gen/v1/onos/yang/yangautoprefix15/level1/newlevel/rev20150205/ModuletestService.java:[33,9] error: cannot find symbol
      [ERROR] symbol: class Person
      [ERROR] location: interface ModuletestService
      [ERROR] /opt/onos-master/onos/utils/test/src/main/java/org/onosproject/yang/gen/v1/onos/yang/yangautoprefix15/level1/newlevel/rev20150205/ModuletestService.java:[40,9] error: cannot find symbol
      [ERROR] symbol: class OfficialDetails
      [ERROR] location: interface ModuletestService
      [ERROR] /opt/onos-master/onos/utils/test/src/main/java/org/onosproject/yang/gen/v1/onos/yang/yangautoprefix15/level1/newlevel/rev20150205/ModuletestService.java:[47,24] error: cannot find symbol
      [ERROR] symbol: class Person
      [ERROR] location: interface ModuletestService
      [ERROR] /opt/onos-master/onos/utils/test/src/main/java/org/onosproject/yang/gen/v1/onos/yang/yangautoprefix15/level1/newlevel/rev20150205/ModuletestService.java:[54,33] error: cannot find symbol
      [ERROR] symbol: class OfficialDetails
      [ERROR] location: interface ModuletestService
      [ERROR] /opt/onos-master/onos/utils/test/src/main/java/org/onosproject/yang/gen/v1/onos/yang/yangautoprefix16/level1/newlevel/rev20150205/ModuletestManager.java:[24,100] error: package org.onosproject.yang.gen.v1.onos.yang.yangautoprefix16.level1.newlevel.rev20150205.moduletest does not exist
      [ERROR] /opt/onos-master/onos/utils/test/src/main/java/org/onosproject/yang/gen/v1/onos/yang/yangautoprefix16/level1/newlevel/rev20150205/ModuletestManager.java:[25,100] error: package org.onosproject.yang.gen.v1.onos.yang.yangautoprefix16.level1.newlevel.rev20150205.moduletest does not exist
      [ERROR] /opt/onos-master/onos/utils/test/src/main/java/org/onosproject/yang/gen/v1/onos/yang/yangautoprefix16/level1/newlevel/rev20150205/ModuletestService.java:[20,100] error: package org.onosproject.yang.gen.v1.onos.yang.yangautoprefix16.level1.newlevel.rev20150205.moduletest does not exist
      [ERROR] /opt/onos-master/onos/utils/test/src/main/java/org/onosproject/yang/gen/v1/onos/yang/yangautoprefix16/level1/newlevel/rev20150205/ModuletestService.java:[21,100] error: package org.onosproject.yang.gen.v1.onos.yang.yangautoprefix16.level1.newlevel.rev20150205.moduletest does not exist
      [ERROR] /opt/onos-master/onos/utils/test/src/main/java/org/onosproject/yang/gen/v1/onos/yang/yangautoprefix16/level1/newlevel/rev20150205/ModuletestManager.java:[52,16] error: cannot find symbol
      [ERROR] symbol: class Person
      [ERROR] location: class ModuletestManager
      [ERROR] /opt/onos-master/onos/utils/test/src/main/java/org/onosproject/yang/gen/v1/onos/yang/yangautoprefix16/level1/newlevel/rev20150205/ModuletestManager.java:[58,11] error: cannot find symbol
      [ERROR] symbol: class Cont1
      [ERROR] location: class ModuletestManager
      [ERROR] /opt/onos-master/onos/utils/test/src/main/java/org/onosproject/yang/gen/v1/onos/yang/yangautoprefix16/level1/newlevel/rev20150205/ModuletestManager.java:[64,31] error: cannot find symbol
      [ERROR] symbol: class Person
      [ERROR] location: class ModuletestManager
      [ERROR] /opt/onos-master/onos/utils/test/src/main/java/org/onosproject/yang/gen/v1/onos/yang/yangautoprefix16/level1/newlevel/rev20150205/ModuletestManager.java:[69,25] error: cannot find symbol
      [ERROR] symbol: class Cont1
      [ERROR] location: class ModuletestManager
      [ERROR] /opt/onos-master/onos/utils/test/src/main/java/org/onosproject/yang/gen/v1/onos/yang/yangautoprefix16/level1/newlevel/rev20150205/ModuletestService.java:[33,9] error: cannot find symbol
      [ERROR] symbol: class Person
      [ERROR] location: interface ModuletestService
      [ERROR] /opt/onos-master/onos/utils/test/src/main/java/org/onosproject/yang/gen/v1/onos/yang/yangautoprefix16/level1/newlevel/rev20150205/ModuletestService.java:[40,4] error: cannot find symbol
      [ERROR] symbol: class Cont1
      [ERROR] location: interface ModuletestService
      [ERROR] /opt/onos-master/onos/utils/test/src/main/java/org/onosproject/yang/gen/v1/onos/yang/yangautoprefix16/level1/newlevel/rev20150205/ModuletestService.java:[47,24] error: cannot find symbol
      [ERROR] symbol: class Person
      [ERROR] location: interface ModuletestService
      [ERROR] /opt/onos-master/onos/utils/test/src/main/java/org/onosproject/yang/gen/v1/onos/yang/yangautoprefix16/level1/newlevel/rev20150205/ModuletestService.java:[54,18] error: cannot find symbol
      [ERROR] symbol: class Cont1
      [ERROR] location: interface ModuletestService
      [ERROR] /opt/onos-master/onos/utils/test/src/main/java/org/onosproject/yang/gen/v1/onos/yang/yangautoprefix15/level1/newlevel/rev20150205/ModuletestManager.java:[24,100] error: package org.onosproject.yang.gen.v1.onos.yang.yangautoprefix15.level1.newlevel.rev20150205.moduletest does not exist
      [ERROR] /opt/onos-master/onos/utils/test/src/main/java/org/onosproject/yang/gen/v1/onos/yang/yangautoprefix15/level1/newlevel/rev20150205/ModuletestManager.java:[25,100] error: package org.onosproject.yang.gen.v1.onos.yang.yangautoprefix15.level1.newlevel.rev20150205.moduletest does not exist
      [ERROR] /opt/onos-master/onos/utils/test/src/main/java/org/onosproject/yang/gen/v1/onos/yang/yangautoprefix15/level1/newlevel/rev20150205/ModuletestManager.java:[52,16] error: cannot find symbol
      [ERROR] symbol: class Person
      [ERROR] location: class ModuletestManager
      [ERROR] /opt/onos-master/onos/utils/test/src/main/java/org/onosproject/yang/gen/v1/onos/yang/yangautoprefix15/level1/newlevel/rev20150205/ModuletestManager.java:[58,16] error: cannot find symbol
      [ERROR] symbol: class OfficialDetails
      [ERROR] location: class ModuletestManager
      [ERROR] /opt/onos-master/onos/utils/test/src/main/java/org/onosproject/yang/gen/v1/onos/yang/yangautoprefix15/level1/newlevel/rev20150205/ModuletestManager.java:[64,31] error: cannot find symbol
      [ERROR] symbol: class Person
      [ERROR] location: class ModuletestManager
      [ERROR] /opt/onos-master/onos/utils/test/src/main/java/org/onosproject/yang/gen/v1/onos/yang/yangautoprefix15/level1/newlevel/rev20150205/ModuletestManager.java:[69,40] error: cannot find symbol
      [ERROR] symbol: class OfficialDetails
      [ERROR] location: class ModuletestManager
      [ERROR] /opt/onos-master/onos/utils/test/src/main/java/org/onosproject/yang/gen/v1/onos/yang/yangautoprefix7/level1/newlevel/rev20150205/ModuletestService.java:[19,99] error: package org.onosproject.yang.gen.v1.onos.yang.yangautoprefix7.level1.newlevel.rev20150205.moduletest does not exist
      [ERROR] /opt/onos-master/onos/utils/test/src/main/java/org/onosproject/yang/gen/v1/onos/yang/yangautoprefix7/level1/newlevel/rev20150205/ModuletestService.java:[31,4] error: cannot find symbol
      [ERROR] symbol: class Cont1
      [ERROR] location: interface ModuletestService
      [ERROR] /opt/onos-master/onos/utils/test/src/main/java/org/onosproject/yang/gen/v1/onos/yang/yangautoprefix7/level1/newlevel/rev20150205/ModuletestService.java:[38,18] error: cannot find symbol
      [ERROR] symbol: class Cont1
      [ERROR] location: interface ModuletestService
      [ERROR] /opt/onos-master/onos/utils/test/src/main/java/org/onosproject/yang/gen/v1/onos/yang/yangautoprefix11/level1/newlevel/rev20150205/ModuletestManager.java:[23,100] error: package org.onosproject.yang.gen.v1.onos.yang.yangautoprefix11.level1.newlevel.rev20150205.moduletest does not exist
      [ERROR] /opt/onos-master/onos/utils/test/src/main/java/org/onosproject/yang/gen/v1/onos/yang/yangautoprefix11/level1/newlevel/rev20150205/ModuletestService.java:[19,100] error: package org.onosproject.yang.gen.v1.onos.yang.yangautoprefix11.level1.newlevel.rev20150205.moduletest does not exist
      [ERROR] /opt/onos-master/onos/utils/test/src/main/java/org/onosproject/yang/gen/v1/onos/yang/yangautoprefix11/level1/newlevel/rev20150205/ModuletestManager.java:[50,11] error: cannot find symbol
      [ERROR] symbol: class Cont1
      [ERROR] location: class ModuletestManager
      [ERROR] /opt/onos-master/onos/utils/test/src/main/java/org/onosproject/yang/gen/v1/onos/yang/yangautoprefix11/level1/newlevel/rev20150205/ModuletestManager.java:[56,25] error: cannot find symbol
      [ERROR] symbol: class Cont1
      [ERROR] location: class ModuletestManager
      [ERROR] /opt/onos-master/onos/utils/test/src/main/java/org/onosproject/yang/gen/v1/onos/yang/yangautoprefix11/level1/newlevel/rev20150205/ModuletestService.java:[31,4] error: cannot find symbol
      [ERROR] symbol: class Cont1
      [ERROR] location: interface ModuletestService
      [ERROR] /opt/onos-master/onos/utils/test/src/main/java/org/onosproject/yang/gen/v1/onos/yang/yangautoprefix11/level1/newlevel/rev20150205/ModuletestService.java:[38,18] error: cannot find symbol
      [ERROR] symbol: class Cont1
      [ERROR] location: interface ModuletestService
      [ERROR] /opt/onos-master/onos/utils/test/src/main/java/org/onosproject/yang/gen/v1/onos/yang/yangautoprefix20/keyless/level1/newlevel/rev20150205/ModuletestManager.java:[24,108] error: package org.onosproject.yang.gen.v1.onos.yang.yangautoprefix20.keyless.level1.newlevel.rev20150205.moduletest does not exist
      [ERROR] /opt/onos-master/onos/utils/test/src/main/java/org/onosproject/yang/gen/v1/onos/yang/yangautoprefix20/keyless/level1/newlevel/rev20150205/ModuletestService.java:[20,108] error: package org.onosproject.yang.gen.v1.onos.yang.yangautoprefix20.keyless.level1.newlevel.rev20150205.moduletest does not exist
      [ERROR] /opt/onos-master/onos/utils/test/src/main/java/org/onosproject/yang/gen/v1/onos/yang/yangautoprefix20/keyless/level1/newlevel/rev20150205/ModuletestManager.java:[51,16] error: cannot find symbol
      [ERROR] symbol: class Person
      [ERROR] location: class ModuletestManager
      [ERROR] /opt/onos-master/onos/utils/test/src/main/java/org/onosproject/yang/gen/v1/onos/yang/yangautoprefix20/keyless/level1/newlevel/rev20150205/ModuletestManager.java:[57,31] error: cannot find symbol
      [ERROR] symbol: class Person
      [ERROR] location: class ModuletestManager
      [ERROR] /opt/onos-master/onos/utils/test/src/main/java/org/onosproject/yang/gen/v1/onos/yang/yangautoprefix20/keyless/level1/newlevel/rev20150205/ModuletestService.java:[32,9] error: cannot find symbol
      [ERROR] symbol: class Person
      [ERROR] location: interface ModuletestService
      [ERROR] /opt/onos-master/onos/utils/test/src/main/java/org/onosproject/yang/gen/v1/onos/yang/yangautoprefix20/keyless/level1/newlevel/rev20150205/ModuletestService.java:[39,24] error: cannot find symbol
      [ERROR] symbol: class Person
      [ERROR] location: interface ModuletestService
      [ERROR] /opt/onos-master/onos/utils/test/src/main/java/org/onosproject/yang/gen/v1/onos/yang/yangautoprefix7/level1/newlevel/rev20150205/ModuletestManager.java:[23,99] error: package org.onosproject.yang.gen.v1.onos.yang.yangautoprefix7.level1.newlevel.rev20150205.moduletest does not exist
      [ERROR] /opt/onos-master/onos/utils/test/src/main/java/org/onosproject/yang/gen/v1/onos/yang/yangautoprefix7/level1/newlevel/rev20150205/ModuletestManager.java:[50,11] error: cannot find symbol
      [ERROR] symbol: class Cont1
      [ERROR] location: class ModuletestManager
      [ERROR] /opt/onos-master/onos/utils/test/src/main/java/org/onosproject/yang/gen/v1/onos/yang/yangautoprefix7/level1/newlevel/rev20150205/ModuletestManager.java:[56,25] error: cannot find symbol
      [ERROR] symbol: class Cont1
      [ERROR] location: class ModuletestManager
      [ERROR] /opt/onos-master/onos/utils/test/src/main/java/org/onosproject/yang/gen/v1/onos/yang/yangautoprefix13/level1/newlevel/rev20150205/ModuletestService.java:[20,100] error: package org.onosproject.yang.gen.v1.onos.yang.yangautoprefix13.level1.newlevel.rev20150205.moduletest does not exist
      [ERROR] /opt/onos-master/onos/utils/test/src/main/java/org/onosproject/yang/gen/v1/onos/yang/yangautoprefix13/level1/newlevel/rev20150205/ModuletestService.java:[32,9] error: cannot find symbol
      [ERROR] symbol: class Person
      [ERROR] location: interface ModuletestService
      [ERROR] /opt/onos-master/onos/utils/test/src/main/java/org/onosproject/yang/gen/v1/onos/yang/yangautoprefix13/level1/newlevel/rev20150205/ModuletestService.java:[39,24] error: cannot find symbol
      [ERROR] symbol: class Person
      [ERROR] location: interface ModuletestService
      [ERROR] /opt/onos-master/onos/utils/test/src/main/java/org/onosproject/yang/gen/v1/onos/yang/yangautoprefix18/level1/newlevel/rev20150205/ModuletestManager.java:[23,100] error: package org.onosproject.yang.gen.v1.onos.yang.yangautoprefix18.level1.newlevel.rev20150205.moduletest does not exist
      [ERROR] /opt/onos-master/onos/utils/test/src/main/java/org/onosproject/yang/gen/v1/onos/yang/yangautoprefix18/level1/newlevel/rev20150205/ModuletestManager.java:[56,11] error: cannot find symbol
      [ERROR] symbol: class Cont1
      [ERROR] location: class ModuletestManager
      [ERROR] /opt/onos-master/onos/utils/test/src/main/java/org/onosproject/yang/gen/v1/onos/yang/yangautoprefix18/level1/newlevel/rev20150205/ModuletestManager.java:[67,25] error: cannot find symbol
      [ERROR] symbol: class Cont1
      [ERROR] location: class ModuletestManager
      [ERROR] /opt/onos-master/onos/utils/test/src/main/java/org/onosproject/yang/gen/v1/onos/yang/yangautoprefix20/level1/newlevel/rev20150205/ModuletestManager.java:[24,100] error: package org.onosproject.yang.gen.v1.onos.yang.yangautoprefix20.level1.newlevel.rev20150205.moduletest does not exist
      [ERROR] /opt/onos-master/onos/utils/test/src/main/java/org/onosproject/yang/gen/v1/onos/yang/yangautoprefix20/level1/newlevel/rev20150205/ModuletestManager.java:[51,16] error: cannot find symbol
      [ERROR] symbol: class Person
      [ERROR] location: class ModuletestManager
      [ERROR] /opt/onos-master/onos/utils/test/src/main/java/org/onosproject/yang/gen/v1/onos/yang/yangautoprefix20/level1/newlevel/rev20150205/ModuletestManager.java:[57,31] error: cannot find symbol
      [ERROR] symbol: class Person
      [ERROR] location: class ModuletestManager
      [ERROR] /opt/onos-master/onos/utils/test/src/main/java/org/onosproject/yang/gen/v1/onos/yang/yangautoprefix13/level1/newlevel/rev20150205/ModuletestManager.java:[24,100] error: package org.onosproject.yang.gen.v1.onos.yang.yangautoprefix13.level1.newlevel.rev20150205.moduletest does not exist
      [ERROR] /opt/onos-master/onos/utils/test/src/main/java/org/onosproject/yang/gen/v1/onos/yang/yangautoprefix13/level1/newlevel/rev20150205/ModuletestManager.java:[51,16] error: cannot find symbol
      [ERROR] symbol: class Person
      [ERROR] location: class ModuletestManager
      [ERROR] /opt/onos-master/onos/utils/test/src/main/java/org/onosproject/yang/gen/v1/onos/yang/yangautoprefix13/level1/newlevel/rev20150205/ModuletestManager.java:[57,31] error: cannot find symbol
      [ERROR] -> [Help 1]
      [ERROR]
      [ERROR] To see the full stack trace of the errors, re-run Maven with the -e switch.
      [ERROR] Re-run Maven using the -X switch to enable full debug logging.
      [ERROR]
      [ERROR] For more information about the errors and possible solutions, please read the following articles:
      [ERROR] [Help 1] http://cwiki.apache.org/confluence/display/MAVEN/MojoFailureException
      root1@root1-HP-EliteBook-840-G2:/opt/onos-master/onos/utils/test$

        Attachments

        No reviews matched the request. Check your Options in the drop-down menu of this sections header.

          Activity

            People

            Assignee:
            bsaraswal bharat saraswal
            Reporter:
            huawei-adarsh Adarsh m
            Votes:
            0 Vote for this issue
            Watchers:
            1 Start watching this issue

              Dates

              Created:
              Updated:
              Resolved: