Uploaded image for project: 'ONOS'
  1. ONOS
  2. ONOS-4935

Defect : Data type not supported error is thrown without any information on the file and line of error.

    XMLWordPrintable

    Details

    • Type: Bug
    • Status: Closed (View Workflow)
    • Priority: Major
    • Resolution: Fixed
    • Affects Version/s: None
    • Fix Version/s: 1.7.0
    • Component/s: None
    • Labels:
      None
    • Story Points:
      17

      Description

      Defect : Data type not supported error is thrown without any information on the file and line of error.

      Logs :
      root1@root1-HP-EliteBook-840-G2:/opt/onos-master/onos/utils/test$ mvn clean install
      [INFO] Scanning for projects...
      [INFO]
      [INFO] ------------------------------------------------------------------------
      [INFO] Building onlab-test 1.7.0-SNAPSHOT
      [INFO] ------------------------------------------------------------------------
      [INFO]
      [INFO] — maven-clean-plugin:2.5:clean (default-clean) @ onlab-test —
      [INFO] Deleting /opt/onos-master/onos/utils/test/target
      [INFO]
      [INFO] — jacoco-maven-plugin:0.7.5.201505241946:prepare-agent (default-prepare-agent) @ onlab-test —
      [INFO] argLine set to -javaagent:/home/root1/.m2/repository/org/jacoco/org.jacoco.agent/0.7.5.201505241946/org.jacoco.agent-0.7.5.201505241946-runtime.jar=destfile=/opt/onos-master/onos/utils/test/target/jacoco.exec -Duser.language=en -Duser.region=US
      [INFO]
      [INFO] — yangutils-maven-plugin:1.0.0-SNAPSHOT:yang2java (default) @ onlab-test —
      [INFO] ------------------------------------------------------------------------
      [INFO] BUILD FAILURE
      [INFO] ------------------------------------------------------------------------
      [INFO] Total time: 2.166 s
      [INFO] Finished at: 2016-07-19T13:02:48+05:30
      [INFO] Final Memory: 20M/313M
      [INFO] ------------------------------------------------------------------------
      [ERROR] Failed to execute goal org.onosproject:yangutils-maven-plugin:1.0.0-SNAPSHOT:yang2java (default) on project onlab-test: Execution default of goal org.onosproject:yangutils-maven-plugin:1.0.0-SNAPSHOT:yang2java failed: given data type is not supported. -> [Help 1]
      [ERROR]
      [ERROR] To see the full stack trace of the errors, re-run Maven with the -e switch.
      [ERROR] Re-run Maven using the -X switch to enable full debug logging.
      [ERROR]
      [ERROR] For more information about the errors and possible solutions, please read the following articles:
      [ERROR] [Help 1] http://cwiki.apache.org/confluence/display/MAVEN/PluginExecutionException
      root1@root1-HP-EliteBook-840-G2:/opt/onos-master/onos/utils/test$

        Attachments

        # Subject Branch Project Status CR V

          Activity

            People

            Assignee:
            Vidyashree-Huawei Vidyashree Rama
            Reporter:
            huawei-adarsh Adarsh m
            Votes:
            0 Vote for this issue
            Watchers:
            4 Start watching this issue

              Dates

              Created:
              Updated:
              Resolved: