Uploaded image for project: 'ONOS'
  1. ONOS
  2. ONOS-4937

Compilation error occurred for typedef with union

    XMLWordPrintable

    Details

    • Type: Bug
    • Status: Closed (View Workflow)
    • Priority: Major
    • Resolution: Fixed
    • Affects Version/s: None
    • Fix Version/s: 1.7.0
    • Component/s: None
    • Labels:
      None
    • Story Points:
      10

      Description

      Logs :
      root1@root1-HP-EliteBook-840-G2:/opt/onos-master/onos/utils/test$ mvn clean install
      [INFO] Scanning for projects...
      [INFO]
      [INFO] ------------------------------------------------------------------------
      [INFO] Building onlab-test 1.7.0-SNAPSHOT
      [INFO] ------------------------------------------------------------------------
      [INFO]
      [INFO] — maven-clean-plugin:2.5:clean (default-clean) @ onlab-test —
      [INFO] Deleting /opt/onos-master/onos/utils/test/target
      [INFO]
      [INFO] — jacoco-maven-plugin:0.7.5.201505241946:prepare-agent (default-prepare-agent) @ onlab-test —
      [INFO] argLine set to -javaagent:/home/root1/.m2/repository/org/jacoco/org.jacoco.agent/0.7.5.201505241946/org.jacoco.agent-0.7.5.201505241946-runtime.jar=destfile=/opt/onos-master/onos/utils/test/target/jacoco.exec -Duser.language=en -Duser.region=US
      [INFO]
      [INFO] — yangutils-maven-plugin:1.0.0-SNAPSHOT:yang2java (default) @ onlab-test —
      [INFO] Source directory added to compilation root: /opt/onos-master/onos/utils/test/target/generated-sources/
      [INFO] Source directory added to compilation root: /opt/onos-master/onos/utils/test/src/main/java/
      [INFO]
      [INFO] — maven-resources-plugin:2.7:resources (default-resources) @ onlab-test —
      [INFO] Using 'UTF-8' encoding to copy filtered resources.
      [INFO] skip non existing resourceDirectory /opt/onos-master/onos/utils/test/src/main/resources
      [INFO] Copying 2 resources
      [INFO] Copying 2 resources
      [INFO]
      [INFO] — maven-compiler-plugin:2.5.1:compile (default-compile) @ onlab-test —
      [INFO] Compiling 9 source files to /opt/onos-master/onos/utils/test/target/classes
      [INFO] -------------------------------------------------------------
      [ERROR] COMPILATION ERROR :
      [INFO] -------------------------------------------------------------
      [ERROR] /opt/onos-master/onos/utils/test/target/generated-sources/org/onosproject/yang/gen/v1/org/opendaylight/yangtools/union/typedef/rev20141124/uniontypedeftest/typedefunion/TypedefUnionUnion.java:[111,22] error: incompatible types: int cannot be converted to String
      [INFO] 1 error
      [INFO] -------------------------------------------------------------
      [INFO] ------------------------------------------------------------------------
      [INFO] BUILD FAILURE
      [INFO] ------------------------------------------------------------------------
      [INFO] Total time: 2.819 s
      [INFO] Finished at: 2016-07-19T17:15:56+05:30
      [INFO] Final Memory: 31M/321M
      [INFO] ------------------------------------------------------------------------
      [ERROR] Failed to execute goal org.apache.maven.plugins:maven-compiler-plugin:2.5.1:compile (default-compile) on project onlab-test: Compilation failure
      [ERROR] /opt/onos-master/onos/utils/test/target/generated-sources/org/onosproject/yang/gen/v1/org/opendaylight/yangtools/union/typedef/rev20141124/uniontypedeftest/typedefunion/TypedefUnionUnion.java:[111,22] error: incompatible types: int cannot be converted to String
      [ERROR] -> [Help 1]
      [ERROR]
      [ERROR] To see the full stack trace of the errors, re-run Maven with the -e switch.
      [ERROR] Re-run Maven using the -X switch to enable full debug logging.
      [ERROR]
      [ERROR] For more information about the errors and possible solutions, please read the following articles:
      [ERROR] [Help 1] http://cwiki.apache.org/confluence/display/MAVEN/MojoFailureException
      root1@root1-HP-EliteBook-840-G2:/opt/onos-master/onos/utils/test$

        Attachments

        No reviews matched the request. Check your Options in the drop-down menu of this sections header.

          Activity

            People

            Assignee:
            bsaraswal bharat saraswal
            Reporter:
            huawei-adarsh Adarsh m
            Votes:
            0 Vote for this issue
            Watchers:
            1 Start watching this issue

              Dates

              Created:
              Updated: