Uploaded image for project: 'ONOS'
  1. ONOS
  2. ONOS-5138

error info is not showing line numbers & file name for "Failed to link "

    XMLWordPrintable

    Details

    • Type: Bug
    • Status: Closed (View Workflow)
    • Priority: Major
    • Resolution: Fixed
    • Affects Version/s: None
    • Fix Version/s: 1.7.0
    • Component/s: None
    • Labels:
      None
    • Environment:

      ONOS build

    • Story Points:
      2

      Description

      [INFO] ------------------------------------------------------------------------
      [INFO] BUILD FAILURE
      [INFO] ------------------------------------------------------------------------
      [INFO] Total time: 2.068 s
      [INFO] Finished at: 2016-08-16T16:44:05+05:30
      [INFO] Final Memory: 19M/322M
      [INFO] ------------------------------------------------------------------------
      [ERROR] Failed to execute goal org.onosproject:yangutils-maven-plugin:1.7.0-SNAPSHOT:yang2java (default) on project onlab-test: Failed to link /nt:network-topology/nt:topology/nt:topology-types/ -> [Help 1]
      org.apache.maven.lifecycle.LifecycleExecutionException: Failed to execute goal org.onosproject:yangutils-maven-plugin:1.7.0-SNAPSHOT:yang2java (default) on project onlab-test: Failed to link /nt:network-topology/nt:topology/nt:topology-types/
      at org.apache.maven.lifecycle.internal.MojoExecutor.execute(MojoExecutor.java:216)
      at org.apache.maven.lifecycle.internal.MojoExecutor.execute(MojoExecutor.java:153)
      at org.apache.maven.lifecycle.internal.MojoExecutor.execute(MojoExecutor.java:145)
      at org.apache.maven.lifecycle.internal.LifecycleModuleBuilder.buildProject(LifecycleModuleBuilder.java:116)
      at org.apache.maven.lifecycle.internal.LifecycleModuleBuilder.buildProject(LifecycleModuleBuilder.java:80)
      at org.apache.maven.lifecycle.internal.builder.singlethreaded.SingleThreadedBuilder.build(SingleThreadedBuilder.java:51)
      at org.apache.maven.lifecycle.internal.LifecycleStarter.execute(LifecycleStarter.java:128)
      at org.apache.maven.DefaultMaven.doExecute(DefaultMaven.java:307)
      at org.apache.maven.DefaultMaven.doExecute(DefaultMaven.java:193)
      at org.apache.maven.DefaultMaven.execute(DefaultMaven.java:106)
      at org.apache.maven.cli.MavenCli.execute(MavenCli.java:862)
      at org.apache.maven.cli.MavenCli.doMain(MavenCli.java:286)
      at org.apache.maven.cli.MavenCli.main(MavenCli.java:197)
      at sun.reflect.NativeMethodAccessorImpl.invoke0(Native Method)
      at sun.reflect.NativeMethodAccessorImpl.invoke(NativeMethodAccessorImpl.java:62)
      at sun.reflect.DelegatingMethodAccessorImpl.invoke(DelegatingMethodAccessorImpl.java:43)
      at java.lang.reflect.Method.invoke(Method.java:498)
      at org.codehaus.plexus.classworlds.launcher.Launcher.launchEnhanced(Launcher.java:289)
      at org.codehaus.plexus.classworlds.launcher.Launcher.launch(Launcher.java:229)
      at org.codehaus.plexus.classworlds.launcher.Launcher.mainWithExitCode(Launcher.java:415)
      at org.codehaus.plexus.classworlds.launcher.Launcher.main(Launcher.java:356)
      Caused by: org.apache.maven.plugin.MojoExecutionException: Failed to link /nt:network-topology/nt:topology/nt:topology-types/
      at org.onosproject.yangutils.plugin.manager.YangUtilManager.resolveDependenciesUsingLinker(YangUtilManager.java:272)
      at org.onosproject.yangutils.plugin.manager.YangUtilManager.execute(YangUtilManager.java:201)
      at org.apache.maven.plugin.DefaultBuildPluginManager.executeMojo(DefaultBuildPluginManager.java:134)
      at org.apache.maven.lifecycle.internal.MojoExecutor.execute(MojoExecutor.java:208)
      ... 20 more
      [ERROR]
      [ERROR] Re-run Maven using the -X switch to enable full debug logging.

        Attachments

        No reviews matched the request. Check your Options in the drop-down menu of this sections header.

          Activity

            People

            Assignee:
            bsaraswal bharat saraswal
            Reporter:
            sathishmurugesan sathishkumar murugesan
            Votes:
            0 Vote for this issue
            Watchers:
            1 Start watching this issue

              Dates

              Created:
              Updated:
              Resolved: