Uploaded image for project: 'ONOS'
  1. ONOS
  2. ONOS-5142

Compilation error occurred when int and uint are given together.

    XMLWordPrintable

    Details

    • Type: Bug
    • Status: Closed (View Workflow)
    • Priority: Major
    • Resolution: Fixed
    • Affects Version/s: None
    • Fix Version/s: 1.7.0
    • Component/s: None
    • Labels:
      None
    • Story Points:
      18

      Description

      Defect : Compilation error occurred when int and uint are given together.

      Yang :
      module moduletest {
      yang-version 1;
      namespace "onos-yang-20:level1:newlevel";
      prefix test;

      organization "huawei";
      contact "adarsh.m@huawei.com";
      description "leaf scenario";

      revision 2015-02-05;
      leaf eleven {
      type union

      { type int8; type int16; type int32; type int64; type uint8; type uint16; type uint32; type uint64; type string; type binary; //type boolean; }

      }
      }

      Logs :
      root1@root1-HP-EliteBook-840-G2:/opt/onos-master/onos/utils/test$ mvn clean install
      [INFO] Scanning for projects...
      [INFO]
      [INFO] ------------------------------------------------------------------------
      [INFO] Building onlab-test 1.7.0-SNAPSHOT
      [INFO] ------------------------------------------------------------------------
      [INFO]
      [INFO] — maven-clean-plugin:2.5:clean (default-clean) @ onlab-test —
      [INFO] Deleting /opt/onos-master/onos/utils/test/target
      [INFO]
      [INFO] — jacoco-maven-plugin:0.7.5.201505241946:prepare-agent (default-prepare-agent) @ onlab-test —
      [INFO] argLine set to -javaagent:/home/root1/.m2/repository/org/jacoco/org.jacoco.agent/0.7.5.201505241946/org.jacoco.agent-0.7.5.201505241946-runtime.jar=destfile=/opt/onos-master/onos/utils/test/target/jacoco.exec -Duser.language=en -Duser.region=US
      [INFO]
      [INFO] — yangutils-maven-plugin:1.7.0-SNAPSHOT:yang2java (default) @ onlab-test —
      [INFO] Source directory added to compilation root: /opt/onos-master/onos/utils/test/target/generated-sources/
      [INFO]
      [INFO] — maven-resources-plugin:2.7:resources (default-resources) @ onlab-test —
      [INFO] Using 'UTF-8' encoding to copy filtered resources.
      [INFO] skip non existing resourceDirectory /opt/onos-master/onos/utils/test/src/main/resources
      [INFO] Copying 4 resources
      [INFO] Copying 4 resources
      [INFO]
      [INFO] — maven-compiler-plugin:2.5.1:compile (default-compile) @ onlab-test —
      [INFO] Compiling 24 source files to /opt/onos-master/onos/utils/test/target/classes
      [INFO] -------------------------------------------------------------
      [ERROR] COMPILATION ERROR :
      [INFO] -------------------------------------------------------------
      [ERROR] /opt/onos-master/onos/utils/test/target/generated-sources/org/onosproject/yang/gen/v1/onos/yang/yangautoprefix20/level1/newlevel/rev20150205/moduletest/ElevenUnion.java:[73,11] error: constructor ElevenUnion(short) is already defined in class ElevenUnion
      [ERROR] /opt/onos-master/onos/utils/test/target/generated-sources/org/onosproject/yang/gen/v1/onos/yang/yangautoprefix20/level1/newlevel/rev20150205/moduletest/ElevenUnion.java:[156,30] error: method of(short) is already defined in class ElevenUnion
      [ERROR] /opt/onos-master/onos/utils/test/target/generated-sources/org/onosproject/yang/gen/v1/onos/yang/yangautoprefix20/level1/newlevel/rev20150205/moduletest/ElevenUnion.java:[359,28] error: cannot find symbol
      [INFO] 3 errors
      [INFO] -------------------------------------------------------------
      [INFO] ------------------------------------------------------------------------
      [INFO] BUILD FAILURE
      [INFO] ------------------------------------------------------------------------
      [INFO] Total time: 3.209 s
      [INFO] Finished at: 2016-08-18T17:44:58+05:30
      [INFO] Final Memory: 33M/379M
      [INFO] ------------------------------------------------------------------------
      [ERROR] Failed to execute goal org.apache.maven.plugins:maven-compiler-plugin:2.5.1:compile (default-compile) on project onlab-test: Compilation failure: Compilation failure:
      [ERROR] /opt/onos-master/onos/utils/test/target/generated-sources/org/onosproject/yang/gen/v1/onos/yang/yangautoprefix20/level1/newlevel/rev20150205/moduletest/ElevenUnion.java:[73,11] error: constructor ElevenUnion(short) is already defined in class ElevenUnion
      [ERROR] /opt/onos-master/onos/utils/test/target/generated-sources/org/onosproject/yang/gen/v1/onos/yang/yangautoprefix20/level1/newlevel/rev20150205/moduletest/ElevenUnion.java:[156,30] error: method of(short) is already defined in class ElevenUnion
      [ERROR] /opt/onos-master/onos/utils/test/target/generated-sources/org/onosproject/yang/gen/v1/onos/yang/yangautoprefix20/level1/newlevel/rev20150205/moduletest/ElevenUnion.java:[359,28] error: cannot find symbol
      [ERROR] -> [Help 1]
      [ERROR]
      [ERROR] To see the full stack trace of the errors, re-run Maven with the -e switch.
      [ERROR] Re-run Maven using the -X switch to enable full debug logging.
      [ERROR]
      [ERROR] For more information about the errors and possible solutions, please read the following articles:
      [ERROR] [Help 1] http://cwiki.apache.org/confluence/display/MAVEN/MojoFailureException
      root1@root1-HP-EliteBook-840-G2:/opt/onos-master/onos/utils/test$ gedit /opt/onos-master/onos/utils/test/target/generated-sources/org/onosproject/yang/gen/v1/onos/yang/yangautoprefix20/level1/newlevel/rev20150205/moduletest/ElevenUnion.java

        Attachments

        No reviews matched the request. Check your Options in the drop-down menu of this sections header.

          Activity

            People

            Assignee:
            bsaraswal bharat saraswal
            Reporter:
            huawei-adarsh Adarsh m
            Votes:
            0 Vote for this issue
            Watchers:
            1 Start watching this issue

              Dates

              Created:
              Updated:
              Resolved: